Web Resource
type: Class
comment: Web resource managed with PostCon System

Web Resource Movement
type: Class
comment: An event for the resource within the PostCon system

Resource biography
type: Property
comment: biographical information for resource
domain: Web Resource
range: Web Resource

Resource Relevancy
type: Property
comment: biographical information for resource
domain: Web Resource
range: Web Resource

Resource Presentation
type: Property
comment: Information related to relevancy of resource
domain: Web Resource
range: Web Resource

Web Content History
type: Property
comment: History of movement of content within system
domain: Web Resource
range: Web Resource

Current Status
type: Property
comment: Current Status of Document (allowable values of Active and Inactive)
domain: Relevancy
range: Literal

Reason
type: Property
comment: Reason
domain: Resource
range: Literal

Movement Type
type: Property
comment: Type of Movement (allowable values of Move, Add, Remove)
domain: Movement
range: Literal

Related Resource
type: Property
comment: Resources within PostCon system related to current resource
range: Web Resource

Resource Requirement
type: Property
comment: External resource required by current resource
range: Web Resource

Resource Type
type: Property
comment: Type of Required Resource
range: Literal